{"text_format":"1","workbook":"xlsx","n_sheets":2,"sheets":["Analysis","Data"],"not_rendered":{"charts":0,"images":1,"macros":1,"external_links":0,"defined_names":2,"comments":1,"pivot_tables":0},"unopened":[],"bounds":{"document_bytes":16777216,"sheet_cells":100000,"rows_first":2000,"rows_last":500,"rows_between":2000,"halvings":0,"cell_chars":16384,"cell_head_chars":4096},"cells_cut":0,"cells_raw":0,"read":"whole","date_system":"1900"}

{"sheet":"Analysis","index":0,"n_rows":27,"n_cols":30,"rows_kept":27,"cut":false,"hidden":false,"merged":[[14,4,14,10],[12,4,12,10],[16,4,16,10],[12,13,12,19],[2,4,2,8],[1,4,1,8],[4,1,4,10],[8,4,8,9],[6,4,6,10],[10,4,10,10],[18,4,18,10],[20,4,20,10],[4,12,4,23],[24,4,24,9],[23,13,24,20],[23,21,24,21],[23,22,24,22],[23,23,24,23],[23,12,24,12],[22,4,22,10],[18,13,18,20],[19,13,19,20],[20,13,20,20],[21,13,21,20],[7,13,7,20],[16,13,16,19]]}
[null,"SUPPORTIVE HOUSING OPPORTUNITIES PLANNER (SHOP): USING SUPPORTIVE HOUSING TO END CHRONIC HOMELESSNESS",null,null,null,null,null,null,null,null,null,null,null,null,null,null,null,null,null,null,null,null,null,null,null,0.3]
[null,null,null,null,"Click Cell Below for Drop-down List",null,null,null,null,null,null,null,null,null,null,null,null,null,null,null,null,null,null,null,null,0.5]
[null,"CoC or State Name:",null,null,"AK - Alaska (state)",null,null,null,null,null,null,null,null,null,null,null,null,null,null,null,null,null,null,null,null,0.8]
[null,null,null,null,null,null,null,null,null,null,null,null,null,null,null,null,null,null,null,null,null,null,null,null,null,1]
[null,"INPUTS",null,null,null,null,null,null,null,null,null,null,"IMPACTS"]
[null,null,null,null,null,null,null,null,null,null,null,null,null,null,null,null,null,null,null,null,null,2017,2018,2019]
[null,"A",100,"=","Individuals experiencing chronic homelessness (Default: Nationally available 2016 Point-In-Time Count data. Or enter most accurate data for beginning of 2017.)",null,null,null,null,null,null,null,1,"Number of individuals experiencing chronic homelessness at beginning of year",null,null,null,null,null,null,null,{"$f":"$C$7","v":100},{"$f":"V24","v":90.3},{"$f":"W24","v":77.599999999999994}]
[null,null,null,null,null,null,null,null,null,null,null,null,2,"Number newly entering or not counted in Point-in-Time count or other data used",null,null,null,null,null,null,null,{"$f":"INT(V7*$C$9)","v":30},{"$f":"INT(W7*$C$9)","v":27},23]
[null,"B",0.3,"=","Annualization factor (based upon projections for inflow and undercount)",null,null,null,null,null,null,null,3,"Projected annual need",null,null,null,null,null,null,null,{"$f":"SUM(V7:V8)","v":130},{"$f":"SUM(W7:W8)","v":117.3},100.6]
[null,null,null,null,null,null,null,null,null,null,null,null,null,null,null,null,null,null,null,null,"%","#","#","#"]
[null,"C",{"$f":"VLOOKUP(E3,Data!B2:K460,4,FALSE)","v":544},"=","Total inventory of supportive housing units for households without children (Default: Nationally available 2016 Housing Inventory Count [HIC] data. Or enter most accurate data for beginning of 2017.) ",null,null,null,null,null,null,null,4,"Total available supportive housing inventory for households without children",null,null,null,null,null,null,null,{"$f":"$C$11","v":544},{"$f":"V11+V21","v":544},{"$f":"W11+W21","v":544}]
[null,null,null,null,null,null,null,null,null,null,null,null,5,"Supportive housing units dedicated to chronic homelessness",null,null,null,null,null,null,{"$f":"$C$15","v":0.27389705882352944},{"$f":"V11*$U$12","v":149},{"$f":"(W11)*$U$12","v":149},{"$f":"(X11-V21)*$U$12","v":149}]
[null,"D",0.15,"=","% of supportive housing units that turnover annually (Default: 15%. Adjust based on local data, as needed.)",null,null,null,null,null,null,null,6,"Annual turnover of dedicated supportive housing units",null,null,null,null,null,null,{"$f":"$C$13","v":0.15},{"$f":"INT(V12*$U$13)","v":22},{"$f":"INT(W12*$U$13)","v":22},{"$f":"INT(X12*$U$13)","v":22},null,{"$f":"IF(AND(C17<>0.3,C17<>0.5,C17<>0.8,C17<>1),C17,\"\")","v":""},{"$f":"IF($Z$13<>\"\",V24,\"\")","v":""},{"$f":"IF($Z$13<>\"\",W24,\"\")","v":""},{"$f":"IF($Z$13<>\"\",X24,\"\")","v":""},{"$f":"IF($Z$13<>\"\",#REF!,\"\")","v":""}]
[]
[null,"E",{"$f":"VLOOKUP(E3,Data!B2:K460,8,FALSE)","v":0.27389705882352944},"=","% of supportive housing dedicated to chronic homelessness (Default: Nationally-available 2016 HIC data. Or enter most accurate data for beginning of 2017.)",null,null,null,null,null,null,null,7,"Total non-dedicated supportive housing for households without children",null,null,null,null,null,null,null,{"$f":"V$11-V12","v":395},{"$f":"W$11-W12","v":395},{"$f":"X$11-X12","v":395}]
[null,null,null,null,null,null,null,null,null,null,null,null,8,"Annual number of non-dedicated supportive housing units that will turnover",null,null,null,null,null,null,{"$f":"$C$13","v":0.15},{"$f":"INT(V15*$U$16)","v":59},{"$f":"INT(W15*$U$16)","v":59},{"$f":"INT(X15*$U$16)","v":59}]
[null,"F",0.3,"=","% of non-dedicated supportive housing prioritizing people experiencing chronic homelessness",null,null,null,null,null,null,null,9,"Non-dedicated supportive housing turnover units prioritized for chronic homelessness",null,null,null,null,null,null,{"$f":"$C$17","v":0.3},{"$f":"V16*$U$17","v":17.7},{"$f":"W16*$U$17","v":17.7},{"$f":"X16*$U$17","v":17.7}]
[]
[null,"G",0,"=","Newly created supportive housing units to become available in 2017",null,null,null,null,null,null,null,10,"Chronically homeless individuals housed through dedicated turnover supportive housing",null,null,null,null,null,null,null,{"$f":"V13","v":22},{"$f":"W13","v":22},{"$f":"X13","v":22}]
[null,null,null,null,null,null,null,null,null,null,null,null,11,"Chronically homeless individuals housed through prioritized turnover supportive housing",null,null,null,null,null,null,null,{"$f":"V17","v":17.7},{"$f":"W17","v":17.7},17.7]
[null,"H",0,"=","Newly created supportive housing units to become available in 2018",null,null,null,null,null,null,null,12,"Chronically homeless individuals housed through newly created supportive housing",null,null,null,null,null,null,null,{"$f":"$C$19","v":0},{"$f":"$C$21","v":0},{"$f":"$C$23","v":0}]
[null,null,null,null,null,null,null,null,null,null,null,null,13,"Total number of individuals experiencing chronic homelessness housed",null,null,null,null,null,null,null,{"$f":"SUM(V19:V21)","v":39.700000000000003},{"$f":"SUM(W19:W21)","v":39.700000000000003},{"$f":"SUM(X19:X21)","v":39.700000000000003}]
[null,"I",0,"=","Newly created supportive housing units to become available in 2019"]
[null,null,null,null,null,null,null,null,null,null,null,null,14,"Number of individuals experiencing chronic homelessness at year-end",null,null,null,null,null,null,null,{"$f":"IF($V9-V22>0,V9-V22,0)","v":90.3},{"$f":"IF(W9-W22>0,W9-W22,0)","v":77.599999999999994},{"$f":"IF(X9-X22>0,X9-X22,0)","v":60.899999999999991}]
[]
[null,null,null,null,null,null,null,null,null,null,null,null,15,"Percent change since end of 2017",null,null,null,null,null,null,null,null,{"$f":"(W24-$V$24)/$V$24","v":-0.14064230343300113},{"$f":"(X24-$V$24)/$V$24","v":-0.32558139534883729}]
[null,"For best printing layout, use landscape orientation and 'Fit to Page' or 'Custom Scale' to 55%."]

{"sheet":"Data","index":1,"n_rows":450,"n_cols":11,"rows_kept":450,"cut":false,"hidden":false,"merged":[]}
["CoC Number","State Name - CoC","Chronically Homeless Individuals in 2016 PIT","Chronically Homeless \nIndividuals in 2015 PIT","Total PSH Beds for Households without Children 2016","Total PSH Units for Households without Children 2015","Total PSH Beds Dedicated to Chronic Homelessness 2016","Total PSH Units Dedicated to Chronic Homelessness 2015","Estimated Percentage of Single Adult PSH Units Dedicated to Chronic Homeless 2016","Estimated Percentage of Single Adult PSH Units Dedicated to Chronic Homeless 2015","Percent Change In Estimated Percentage of Single Adult PSH Units Dedicated to Chronic Homelessness from 2015 to 2016"]
["AK","AK - Alaska (state)",{"$f":"SUM(C3:C4)","v":112},182,{"$f":"SUM(E3:E4)","v":544},521,{"$f":"SUM(G3:G4)","v":149},232,{"$f":"G2/E2","v":0.27389705882352944},{"$f":"H2/F2","v":0.44529750479846447},{"$f":"I2-J2","v":-0.17140044597493503}]
["AK-500","AK - Anchorage CoC",48,106,350,324,90,175,{"$f":"G3/E3","v":0.25714285714285712},{"$f":"H3/F3","v":0.54012345679012341},{"$f":"I3-J3","v":-0.2829805996472663}]
["AK-501","AK - Alaska Balance of State CoC",64,76,194,197,59,57,0.30412371134020616,0.28934010152284262,1.4783609817363541E-2]
["AL","AL - Alabama (state)",{"$f":"SUM(C6:C13)","v":390},557,{"$f":"SUM(E6:E13)","v":2054},1788,{"$f":"SUM(G6:G13)","v":938},554,0.45666991236611487,0.30984340044742731,0.14682651191868756]
["AL-500","AL - Birmingham/Jefferson, St. Clair, Shelby Counties CoC",92,239,720,726,395,273,0.54861111111111116,0.37603305785123969,0.17257805325987147]
["AL-501","AL - Mobile City & County/Baldwin County CoC",80,92,198,186,88,112,0.44444444444444442,0.60215053763440862,-0.1577060931899642]
["AL-502","AL - Florence/Northwest Alabama CoC",32,18,36,56,0,52,0,0.9285714285714286,-0.9285714285714286]
["AL-503","AL - Huntsville/North Alabama CoC",100,117,228,198,78,93,0.34210526315789475,0.46969696969696972,-0.12759170653907498]
["AL-504","AL - Montgomery City & County CoC",28,24,341,308,228,0,0.66862170087976536,0,0.66862170087976536]
["AL-505*","AL - Gadsden/Northeast Alabama CoC",22,2,0,12,0,0,{"$error":"#DIV/0!"},0,{"$error":"#DIV/0!"}]
["AL-506","AL - Tuscaloosa City & County CoC",1,40,290,258,136,0,0.4689655172413793,0,0.4689655172413793]
["AL-507","AL - Alabama Balance of State CoC",35,25,241,44,13,24,5.3941908713692949E-2,0.54545454545454541,-0.49151263674085244]
["AR","AR - Arkansas (state)",{"$f":"SUM(C15:C21)","v":417},524,{"$f":"SUM(E15:E21)","v":758},379,{"$f":"SUM(G15:G21)","v":189},0,0.24934036939313983,0,0.24934036939313983]
["AR-500","AR - Little Rock/Central Arkansas CoC",206,215,619,248,79,0,0.12762520193861066,0,0.12762520193861066]
["AR-501","AR - Fayetteville/Northwest Arkansas CoC",76,118,106,98,106,0,1,0,1]
["AR-503","AR - Arkansas  Balance of State  CoC",81,91,21,21,4,0,0.19047619047619047,0,0.19047619047619047]
["AR-504*","AR- Delta Hills CoC",0,0,0,0,0,0,{"$error":"#DIV/0!"},{"$error":"#DIV/0!"},{"$error":"#DIV/0!"}]
["AR-505","AR - Southeast Arkansas",1,2,12,12,0,0,0,0,0]
["AR-508*","AR - Old Fort Homeless Coalition",48,90,0,0,0,0,{"$error":"#DIV/0!"},{"$error":"#DIV/0!"},{"$error":"#DIV/0!"}]
["AR-512*","AR - Boone, Baxter, Marion, Newton Counties CoC",5,8,0,0,0,0,{"$error":"#DIV/0!"},{"$error":"#DIV/0!"},{"$error":"#DIV/0!"}]
["AZ","AZ - Arizona (state)",{"$f":"SUM(C23:C25)","v":1327},1246,{"$f":"SUM(E23:E25)","v":4979},4680,{"$f":"SUM(G23:G25)","v":976},1207,0.19602329785097408,0.25790598290598293,-6.1882685055008851E-2]
["AZ-500","AZ - Arizona Balance of State CoC",407,475,559,253,91,106,0.16279069767441862,0.4189723320158103,-0.25618163434139168]
["AZ-501","AZ - Tucson/Pima County CoC",211,328,1182,1168,94,182,7.952622673434856E-2,0.15582191780821919,-7.6295691073870631E-2]
["AZ-502","AZ - Phoenix/Mesa/Maricopa County Regional CoC",709,443,3238,3259,791,919,0.24428659666460778,0.28198833998158945,-3.7701743316981673E-2]
["CA","CA - California (state)",{"$f":"SUM(C27:C69)","v":29802},29178,{"$f":"SUM(E27:E69)","v":38042},33873,{"$f":"SUM(G27:G69)","v":14460},15590,0.38010619841228116,0.46024857556165677,-8.014237714937561E-2]
["CA-500","CA - San Jose/Santa Clara City & County CoC",2095,2169,1512,1572,1206,1570,0.79761904761904767,0.99872773536895676,-0.20110868774990909]
["CA-501","CA - San Francisco CoC",1805,1574,5687,5454,2154,3019,0.37875857218216985,0.55353868720205357,-0.17478011501988372]
["CA-502","CA - Oakland, Berkeley /Alameda County CoC",668,660,1627,1606,524,410,0.32206515058389673,0.25529265255292655,6.6772498030970184E-2]
["CA-503","CA - Sacramento City & County CoC",507,466,1628,1442,1070,1079,0.65724815724815722,0.74826629680998613,-9.1018139561828915E-2]
["CA-504","CA - Santa Rosa/Petaluma/Sonoma County CoC",699,702,478,488,249,291,0.52092050209205021,0.59631147540983609,-7.5390973317785881E-2]
["CA-505","CA - Richmond/Contra Costa County CoC",346,551,473,404,207,0,0.43763213530655393,0,0.43763213530655393]
["CA-506","CA - Salinas/Monterey, San Benito Counties CoC",631,598,257,279,0,241,0,0.86379928315412191,-0.86379928315412191]
["CA-507","CA - Marin County CoC",257,263,423,404,117,93,0.27659574468085107,0.23019801980198021,4.6397724878870866E-2]
["CA-508","CA - Watsonville/Santa Cruz City & County CoC",498,512,373,377,360,396,0.9651474530831099,1.0503978779840848,-8.5250424900974897E-2]
["CA-509","CA - Mendocino County CoC",177,106,137,137,0,0,0,0,0]
["CA-510","CA - Turlock/Modesto/Stanislaus County CoC",238,43,290,248,149,0,0.51379310344827589,0,0.51379310344827589]
["CA-511","CA - Stockton/San Joaquin County CoC",244,271,463,437,160,211,0.34557235421166305,0.48283752860411899,-0.13726517439245595]
["CA-512","CA - Daly/San Mateo County CoC",235,313,664,532,263,270,0.39608433734939757,0.50751879699248126,-0.11143445964308368]
["CA-513","CA - Visalia, Kings, Tulare Counties CoC",241,338,120,105,52,45,0.43333333333333335,0.42857142857142855,4.7619047619048005E-3]
["CA-514","CA - Fresno/Madera County CoC",529,366,712,692,465,521,0.6530898876404494,0.75289017341040465,-9.9800285769955255E-2]
["CA-515","CA - Roseville/Rocklin/Placer, Nevada Counties CoC",313,290,205,166,59,57,0.28780487804878047,0.34337349397590361,-5.5568615927123144E-2]
["CA-516","CA - Redding/Shasta County CoC",394,286,44,34,34,34,0.77272727272727271,1,-0.22727272727272729]
["CA-517","CA - Napa City & County CoC",94,125,46,46,36,40,0.78260869565217395,0.86956521739130432,-8.6956521739130377E-2]
["CA-518","CA - Vallejo/Solano County CoC",252,223,135,86,62,62,0.45925925925925926,0.72093023255813948,-0.26167097329888023]
["CA-519","CA - Chico/Paradise/Butte County CoC",238,250,120,42,0,34,0,0.80952380952380953,-0.80952380952380953]
["CA-520","CA - Merced City & County CoC",224,221,86,51,22,14,0.2558139534883721,0.27450980392156865,-1.8695850433196548E-2]
["CA-521","CA - Davis/Woodland/Yolo County CoC",75,82,56,75,30,67,0.5357142857142857,0.89333333333333331,-0.35761904761904761]
["CA-522","CA - Humboldt County CoC",362,372,92,68,84,89,0.91304347826086951,1.3088235294117647,-0.39578005115089521]
["CA-523*","CA - Colusa, Glen, Lake, Tehama, Trinity Counties CoC",31,32,0,0,0,0,{"$error":"#DIV/0!"},{"$error":"#DIV/0!"},{"$error":"#DIV/0!"}]
["CA-524*","CA - Yuba City, Marysville/Sutter, Yuba Counties CoC",70,39,0,0,0,0,{"$error":"#DIV/0!"},{"$error":"#DIV/0!"},{"$error":"#DIV/0!"}]
["CA-525*","CA - El Dorado County CoC",95,58,0,0,0,0,{"$error":"#DIV/0!"},{"$error":"#DIV/0!"},{"$error":"#DIV/0!"}]
["CA-526","CA - Tuolumne, Calaveras, Amador, Mariposa Counties CoC",129,98,16,21,8,6,0.5,0.2857142857142857,0.2142857142857143]
["CA-527*","CA- Tehama County CoC",29,30,0,0,0,0,{"$error":"#DIV/0!"},{"$error":"#DIV/0!"},{"$error":"#DIV/0!"}]
["CA- 529*","CA- Lake County CoC",12,0,0,0,0,0,{"$error":"#DIV/0!"},{"$error":"#DIV/0!"},{"$error":"#DIV/0!"}]
["CA-600","CA - Los Angeles City & County CoC",12970,12356,13782,11447,4369,4364,0.31700769119140909,0.38123525814623921,-6.4227566954830118E-2]
["CA-601","CA - San Diego City and County CoC",1345,1547,2826,2343,494,380,0.17480537862703469,0.16218523260776782,1.2620146019266865E-2]
["CA-602","CA - Santa Ana/Anaheim/Orange County CoC",711,558,1456,1429,189,195,0.12980769230769232,0.1364590622813156,-6.6513699736232834E-3]
["CA-603","CA - Santa Maria/Santa Barbara County CoC",426,347,429,404,162,176,0.3776223776223776,0.43564356435643564,-5.8021186734058039E-2]
["CA-604","CA - Bakersfield/Kern County CoC",254,161,649,708,518,525,0.79815100154083207,0.74152542372881358,5.662557781201849E-2]
["CA-606","CA - Long Beach CoC",800,905,929,712,260,111,0.2798708288482239,0.15589887640449437,0.12397195244372952]
["CA-607","CA - Pasadena CoC",193,183,214,177,55,44,0.2570093457943925,0.24858757062146894,8.4217751729235568E-3]
["CA-608","CA - Riverside City & County CoC",369,490,879,778,759,712,0.86348122866894195,0.91516709511568128,-5.1685866446739337E-2]
["CA-609","CA - San Bernardino City & County CoC",376,498,588,603,107,282,0.18197278911564627,0.46766169154228854,-0.28568890242664224]
["CA-611","CA - Oxnard/San Buenaventura/Ventura County CoC",296,469,376,278,129,105,0.34308510638297873,0.37769784172661869,-3.4612735343639955E-2]
["CA-612","CA - Glendale CoC",95,57,82,86,60,102,0.73170731707317072,1.1860465116279071,-0.45433919455473637]
["CA-613","CA - Imperial County CoC",60,162,0,0,0,0,{"$f":"G67/E67","v":{"$error":"#DIV/0!"}},{"$f":"H67/F67","v":{"$error":"#DIV/0!"}},{"$f":"I67-J67","v":{"$error":"#DIV/0!"}}]
["CA-614","CA - San Luis Obispo County CoC",388,388,188,142,47,45,0.25,0.31690140845070425,-6.6901408450704247E-2]
["CA-615*","Inyo, Mono, Alpine Counties CoC",31,19,0,0,0,0,{"$error":"#DIV/0!"},{"$error":"#DIV/0!"},{"$error":"#DIV/0!"}]
["CO","CO - Colorado (state)",{"$f":"SUM(C71:C73)","v":1642},1572,{"$f":"SUM(E71:E73)","v":2886},2481,{"$f":"SUM(G71:G73)","v":870},1394,0.30145530145530147,0.56187021362353895,-0.26041491216823748]
["CO-500","CO - Colorado Balance of State CoC",571,605,522,478,161,140,0.30842911877394635,0.29288702928870292,1.5542089485243438E-2]
["CO-503","CO - Metropolitan Denver Homeless Initiative",716,692,2019,1713,564,887,0.27934621099554235,0.51780502043199061,-0.23845880943644826]
["CO-504","CO - Colorado Springs/El Paso County CoC",355,275,345,290,145,367,0.42028985507246375,1.2655172413793103,-0.84522738630684657]
["CT","CT - Connecticut (state)",{"$f":"SUM(C75:C76)","v":439},538,{"$f":"SUM(E75:E76)","v":4468},3872,{"$f":"SUM(G75:G76)","v":2520},2464,0.56401074306177257,0.63636363636363635,-7.2352893301863785E-2]
["CT-503","CT - Bridgeport/Stratford/Fairfield CoC",83,116,959,850,628,625,0.65484880083420227,0.73529411764705888,-8.0445316812856604E-2]
["CT-505","CT - Connecticut Balance of State CoC",356,364,3509,2453,1892,1352,0.53918495297805646,0.55116184264166324,-1.1976889663606771E-2]
["DC-500","DC - District of Columbia CoC",1501,1593,3260,2976,3248,5679,0.996319018404908,1.908266129032258,-0.91194711062735001]
["DE-500","DE - Delaware Statewide CoC",65,64,542,664,357,248,0.65867158671586712,0.37349397590361444,0.28517761081225268]
["FL","FL - Florida (state)",{"$f":"SUM(C80:C106)","v":5415},6021,{"$f":"SUM(E80:E106)","v":10053},9672,{"$f":"SUM(G80:G106)","v":4429},5327,0.44056500547100369,0.55076509511993388,-0.11020008964893019]
["FL-500","FL - Sarasota/Bradenton/Manatee, Sarasota Counties CoC",294,215,235,158,18,225,7.6595744680851063E-2,1.4240506329113924,-1.3474548882305415]
["FL-501","FL - Tampa/Hillsborough County CoC",244,303,980,941,245,247,0.25,0.26248671625929859,-1.2486716259298591E-2]
["FL-502","FL - St. Petersburg/Clearwater/Largo/Pinellas County CoC",603,631,674,957,212,529,0.31454005934718099,0.55276907001044928,-0.23822901066326829]
["FL-503","FL - Lakeland, Winterhaven/Polk CoC",79,87,62,60,0,40,0,0.66666666666666663,-0.66666666666666663]
["FL-504","FL - Daytona Beach/Daytona/Volusia, Flagler Counties CoC",180,246,318,262,56,64,0.1761006289308176,0.24427480916030533,-6.8174180229487735E-2]
["FL-505","FL - Fort Walton Beach/Okaloosa, Walton Counties CoC",267,274,0,0,0,0,{"$error":"#DIV/0!"},{"$error":"#DIV/0!"},{"$error":"#DIV/0!"}]
["FL-506","FL - Tallahassee/Leon County CoC",78,129,278,263,129,128,0.46402877697841727,0.48669201520912547,-2.2663238230708205E-2]
["FL-507","FL - Orlando/Orange, Osceola, Seminole Counties CoC",106,172,1363,1361,1339,845,0.98239178283198825,0.62086700955180019,0.36152477328018806]
["FL-508","FL - Gainesville/Alachua, Putnam Counties CoC",253,377,463,477,0,579,0,1.2138364779874213,-1.2138364779874213]
["FL-509","FL - Fort Pierce/St. Lucie, Indian River, Martin Counties CoC",77,110,182,173,115,173,0.63186813186813184,1,-0.36813186813186816]
["FL-510","FL - Jacksonville-Duval, Clay Counties CoC",325,327,418,385,329,199,0.78708133971291872,0.51688311688311683,0.27019822282980188]
["FL-511","FL - Pensacola/Escambia/Santa Rosa County CoC",189,219,323,312,0,0,0,0,0]
["FL-512","FL - Saint Johns County CoC",35,112,6,46,0,0,0,0,0]
["FL-513","FL - Palm Bay/Melbourne/Brevard County CoC",163,148,46,20,3,32,6.5217391304347824E-2,1.6,-1.5347826086956522]
["FL-514","FL - Ocala/Marion County CoC",65,66,45,40,5,9,0.1111111111111111,0.22500000000000001,-0.1138888888888889]
["FL-515","FL - Panama City/Bay, Jackson Counties CoC",25,25,0,0,0,0,{"$error":"#DIV/0!"},{"$error":"#DIV/0!"},{"$error":"#DIV/0!"}]
["FL-517","FL - Hendry, Hardee, Highlands Counties CoC",323,227,17,14,6,54,0.35294117647058826,3.8571428571428572,-3.5042016806722689]
["FL-518","FL - Columbia, Hamilton, Lafayette, Suwannee Counties CoC",175,170,14,14,14,27,1,1.9285714285714286,-0.9285714285714286]
["FL-519","FL - Pasco County CoC",267,296,97,19,3,0,3.0927835051546393E-2,0,3.0927835051546393E-2]
["FL-520","FL - Citrus, Hernando, Lake, Sumter Counties CoC",28,36,32,28,18,16,0.5625,0.5714285714285714,-8.9285714285713969E-3]
["FL-600","FL - Miami/Dade County CoC",435,486,2264,2167,1103,1304,0.48719081272084808,0.60175357637286575,-0.11456276365201767]
["FL-601","FL - Ft Lauderdale/Broward County CoC",400,427,1311,1198,521,529,0.39740655987795576,0.44156928213689484,-4.416272225893908E-2]
["FL-602","FL - Punta Gorda/Charlotte County CoC",71,135,105,19,20,17,0.19047619047619047,0.89473684210526316,-0.7042606516290727]
["FL-603","FL - Ft Myers/Cape Coral/Lee County CoC",82,171,107,116,9,12,8.4112149532710276E-2,0.10344827586206896,-1.9336126329358688E-2]
["FL-604","FL - Monroe County CoC",126,148,155,165,46,40,0.29677419354838708,0.24242424242424243,5.4349951124144646E-2]
["FL-605","FL - West Palm Beach/Palm Beach County CoC",452,448,534,461,238,237,0.44569288389513106,0.51409978308026028,-6.8406899185129211E-2]
["FL-606","FL - Naples/Collier County CoC",73,36,24,16,0,21,0,1.3125,-1.3125]
["GA","GA - Georgia (state)",{"$f":"SUM(C108:C116)","v":1658},1994,{"$f":"SUM(E108:E116)","v":5493},5158,{"$f":"SUM(G108:G116)","v":2532},2725,0.46095030038230478,0.5283055447848003,-6.7355244402495518E-2]
["GA-500","GA - Atlanta Continuum of Care",531,765,1739,1754,1677,875,0.96434732604945372,0.49885974914481185,0.46548757690464188]
["GA-501","GA - Georgia Balance of State CoC",793,844,1549,1413,431,450,0.27824402840542284,0.31847133757961782,-4.0227309174194981E-2]
["GA-502","GA - Fulton County Continuum of Care",9,22,197,197,197,0,1,0,1]
["GA-503","GA - Athens/Clarke County CoC",49,32,139,93,45,67,0.32374100719424459,0.72043010752688175,-0.39668910033263716]
["GA-504","GA - Augusta-Richmond CoC",35,34,20,21,0,0,0,0,0]
["GA-505","GA - Columbus-Muscogee/Russell County CoC",35,59,141,141,10,0,7.0921985815602842E-2,0,7.0921985815602842E-2]
["GA-506","GA - Marietta/Cobb County CoC",36,42,203,191,49,49,0.2413793103448276,0.25654450261780104,-1.5165192272973443E-2]
["GA-507","GA - Savannah/Chatham County CoC",149,113,248,248,44,136,0.17741935483870969,0.54838709677419351,-0.37096774193548382]
["GA-508","GA - DeKalb County Continuum of Care",21,83,1257,1100,79,1148,6.2848050914876691E-2,1.0436363636363637,-0.98078831272148703]
["GU-500","GU - Guam CoC",15,765,98,77,46,62,0.46938775510204084,0.80519480519480524,-0.3358070500927644]
["HI","HI - Hawaii (state)",{"$f":"SUM(C119:C120)","v":1659},1372,{"$f":"SUM(E119:E120)","v":1695},961,{"$f":"SUM(G119:G120)","v":695},573,0.41002949852507375,0.59625390218522367,-0.18622440366014992]
["HI-500","HI - Hawaii Balance of State CoC",665,593,328,280,190,228,0.57926829268292679,0.81428571428571428,-0.23501742160278749]
["HI-501","HI - Honolulu CoC",994,779,1367,681,505,345,0.36942209217264083,0.50660792951541855,-0.13718583734277773]
{"$rows_left_out":330}